Less More Up Down Hide
Linux Kernel Cross Compile Tests

Test Details 2.6.31.5/score/defconfig/compile

id

68248

version

2.6.31.5

startdate

2009-10-23 01:45:01.465282+00

enddate

2009-10-23 01:46:06.334674+00

success

f

testtype

compile

project

linux-kernel

owner

xtest@defiant.starfleet

legacyid

state

3

arch

score

build-disk-space-used

4.0K

config

defconfig

gcc-version

4.2.1

host-gcc-version

4.1.2 20061115 (prerelease) (Debian 4.1.1-21)

ld-version

2.19.51.20081224

org-version

2.6.31.5

test

compile

total-disk-space-used

405M

log

# /opt/score-linux/bin:/usr/src/xtest/bin:/usr/src/xtest/bin:/bin:/usr/bin:/usr/local/bin
VERSION = 2
PATCHLEVEL = 6
SUBLEVEL = 31
EXTRAVERSION = .5
NAME = Man-Eating Seals of Antiquity
Makefile:527: /arch/score/Makefile: No such file or directory
make: *** No rule to make target `/arch/score/Makefile'.  Stop.
## XP /opt/score-linux/bin
## make HOSTCC=gcc-4.1 ARCH=score CROSS_COMPILE=score-linux- CROSS32_COMPILE= O=out/score defconfig
/Makefile:444: /arch/score/Makefile: No such file or directory
make[1]: *** No rule to make target `/arch/score/Makefile'.  Stop.
make: *** [sub-make] Error 2
## make HOSTCC=gcc-4.1 ARCH=score CROSS_COMPILE=score-linux- CROSS32_COMPILE= O=out/score 
/Makefile:527: /arch/score/Makefile: No such file or directory
make[1]: *** No rule to make target `/arch/score/Makefile'.  Stop.
make: *** [sub-make] Error 2
/Makefile:527: /arch/score/Makefile: No such file or directory
make[1]: *** No rule to make target `/arch/score/Makefile'.  Stop.
make: *** [sub-make] Error 2

Fri, 17 Aug 2018 11:08:32 +0000, 0.0868s, 670.695kB