Less More Up Down Hide
Linux Kernel Cross Compile Tests

Test Details 2.6.32-rc5-git1/score/defconfig/compile

id

68182

version

2.6.32-rc5-git1

startdate

2009-10-17 02:45:03.331662-04

enddate

2009-10-17 02:47:36.107604-04

success

f

testtype

compile

project

linux-kernel

owner

xtest@defiant.starfleet

legacyid

state

3

arch

score

build-disk-space-used

2.4M

config

defconfig

gcc-version

4.2.1

host-gcc-version

4.1.2 20061115 (prerelease) (Debian 4.1.1-21)

ld-version

2.19.51.20081224

org-version

2.6.32-rc5-git1

test

compile

total-disk-space-used

425M

log

# /opt/score-linux/bin:/usr/src/xtest/bin:/usr/src/xtest/bin:/bin:/usr/bin:/usr/local/bin
VERSION = 2
PATCHLEVEL = 6
SUBLEVEL = 32
EXTRAVERSION = -rc5-git1
NAME = Man-Eating Seals of Antiquity
## XP /opt/score-linux/bin
## make HOSTCC=gcc-4.1 ARCH=score CROSS_COMPILE=score-linux- CROSS32_COMPILE= O=out/score defconfig
  HOSTCC  scripts/basic/fixdep
  HOSTCC  scripts/basic/docproc
  HOSTCC  scripts/basic/hash
  GEN     out/score/Makefile
  HOSTCC  scripts/kconfig/conf.o
  HOSTCC  scripts/kconfig/kxgettext.o
  SHIPPED scripts/kconfig/zconf.tab.c
  SHIPPED scripts/kconfig/lex.zconf.c
  SHIPPED scripts/kconfig/zconf.hash.c
  HOSTCC  scripts/kconfig/zconf.tab.o
  HOSTLD  scripts/kconfig/conf
*** Default configuration is based on 'spct6600_defconfig'
#
# configuration written to .config
#
## make HOSTCC=gcc-4.1 ARCH=score CROSS_COMPILE=score-linux- CROSS32_COMPILE= O=out/score 
  GEN     out/score/Makefile
scripts/kconfig/conf -s arch/score/Kconfig
  Using  as source for kernel
  GEN     out/score/Makefile
  CHK     include/linux/version.h
  UPD     include/linux/version.h
  CHK     include/linux/utsrelease.h
  UPD     include/linux/utsrelease.h
  SYMLINK include/asm -> include/asm-score
  CC      kernel/bounds.s
  GEN     include/linux/bounds.h
  CC      arch/score/kernel/asm-offsets.s
  GEN     include/asm/asm-offsets.h
  CALL    /scripts/checksyscalls.sh
  CC      scripts/mod/empty.o
  HOSTCC  scripts/mod/mk_elfconfig
  MKELF   scripts/mod/elfconfig.h
  HOSTCC  scripts/mod/file2alias.o
  HOSTCC  scripts/mod/modpost.o
  HOSTCC  scripts/mod/sumversion.o
  HOSTLD  scripts/mod/modpost
  HOSTCC  scripts/conmakehash
  CC      init/main.o
  CHK     include/linux/compile.h
  UPD     include/linux/compile.h
  CC      init/version.o
  CC      init/do_mounts.o
  CC      init/do_mounts_rd.o
  CC      init/do_mounts_initrd.o
  LD      init/mounts.o
  CC      init/initramfs.o
  CC      init/calibrate.o
  LD      init/built-in.o
  HOSTCC  usr/gen_init_cpio
  GEN     usr/initramfs_data.cpio
  AS      usr/initramfs_data.o
  LD      usr/built-in.o
  AS      arch/score/kernel/entry.o
  CC      arch/score/kernel/init_task.o
  CC      arch/score/kernel/irq.o
  CC      arch/score/kernel/process.o
  CC      arch/score/kernel/ptrace.o
  CC      arch/score/kernel/setup.o
  CC      arch/score/kernel/signal.o
  CC      arch/score/kernel/sys_score.o
  CC      arch/score/kernel/time.o
  CC      arch/score/kernel/traps.o
  CC      arch/score/kernel/sys_call_table.o
  CC      arch/score/kernel/module.o
  LD      arch/score/kernel/built-in.o
  AS      arch/score/kernel/head.o
  LDS     arch/score/kernel/vmlinux.lds
  CC      arch/score/mm/cache.o
  CC      arch/score/mm/extable.o
  CC      arch/score/mm/fault.o
  CC      arch/score/mm/init.o
/arch/score/mm/init.c: In function 'mem_init':
/arch/score/mm/init.c:104: error: too few arguments to function 'kclist_add'
/arch/score/mm/init.c:106: error: too few arguments to function 'kclist_add'
make[2]: *** [arch/score/mm/init.o] Error 1
make[1]: *** [arch/score/mm] Error 2
make: *** [sub-make] Error 2
  CLEAN   
  CLEAN   arch/score/kernel
  CLEAN   init
  CLEAN   usr
  CLEAN   .tmp_versions
  CLEAN   scripts/basic
  CLEAN   scripts/kconfig
  CLEAN   scripts/mod
  CLEAN   scripts
  CLEAN   include/config include2
  CLEAN   .config include/asm .version include/linux/autoconf.h include/linux/version.h include/linux/utsrelease.h include/linux/bounds.h include/asm-score/asm-offsets.h include/asm/asm-offsets.h

Mon, 24 Apr 2017 05:19:51 -0400, 0.0101s, 598.508kB