Less More Up Down Hide
Linux Kernel Cross Compile Tests

Test Details 2.6.32-rc4-next-20091014/ia64/defconfig/compile

id

67996

version

2.6.32-rc4-next-20091014

startdate

2009-10-15 12:30:06.777943-04

enddate

2009-10-15 12:32:28.021699-04

success

f

testtype

compile

project

linux-kernel

owner

xtest@xenon.starfleet

legacyid

state

3

arch

ia64

build-disk-space-used

3.2M

config

defconfig

gcc-version

4.3.2 (GCC)

host-gcc-version

4.1.2 20061115 (prerelease) (Debian 4.1.1-21)

ld-version

2.18.50.0.8.20080709

org-version

2.6.32-rc4-next-20091014

test

compile

total-disk-space-used

425M

log

# /usr/cc218/4.3:/usr/cc218/ia64/bin:/usr/src/xtest/bin:/usr/src/xtest/bin:/bin:/usr/bin:/usr/local/bin
VERSION = 2
PATCHLEVEL = 6
SUBLEVEL = 32
EXTRAVERSION = -rc4
NAME = Man-Eating Seals of Antiquity
## XP /usr/cc218/4.3:/usr/cc218/ia64/bin
## make HOSTCC=gcc-4.1 ARCH=ia64 CROSS_COMPILE=ia64-linux- CROSS32_COMPILE= O=out/ia64 defconfig
  HOSTCC  scripts/basic/fixdep
  HOSTCC  scripts/basic/docproc
  HOSTCC  scripts/basic/hash
  GEN     out/ia64/Makefile
  HOSTCC  scripts/kconfig/conf.o
  HOSTCC  scripts/kconfig/kxgettext.o
  SHIPPED scripts/kconfig/zconf.tab.c
  SHIPPED scripts/kconfig/lex.zconf.c
  SHIPPED scripts/kconfig/zconf.hash.c
  HOSTCC  scripts/kconfig/zconf.tab.o
  HOSTLD  scripts/kconfig/conf
*** Default configuration is based on 'generic_defconfig'
arch/ia64/configs/generic_defconfig:319:warning: symbol value 'm' invalid for INET_LRO
#
# configuration written to .config
#
## make HOSTCC=gcc-4.1 ARCH=ia64 CROSS_COMPILE=ia64-linux- CROSS32_COMPILE= O=out/ia64 
  GEN     out/ia64/Makefile
scripts/kconfig/conf -s arch/ia64/Kconfig
  CC      arch/ia64/kernel/nr-irqs.s
  GEN     include/generated/nr-irqs.h
  Using  as source for kernel
  GEN     out/ia64/Makefile
  CHK     include/linux/version.h
  UPD     include/linux/version.h
  CHK     include/generated/utsrelease.h
  UPD     include/generated/utsrelease.h
  CC      kernel/bounds.s
  GEN     include/generated/bounds.h
  CC      arch/ia64/kernel/asm-offsets.s
  GEN     include/generated/asm-offsets.h
  CALL    /scripts/checksyscalls.sh
<stdin>:1519:2: warning: #warning syscall perf_event_open not implemented
<stdin>:1523:2: warning: #warning syscall recvmmsg not implemented
  HOSTCC  scripts/genksyms/genksyms.o
  SHIPPED scripts/genksyms/lex.c
  SHIPPED scripts/genksyms/parse.h
  SHIPPED scripts/genksyms/keywords.c
  HOSTCC  scripts/genksyms/lex.o
  SHIPPED scripts/genksyms/parse.c
  HOSTCC  scripts/genksyms/parse.o
  HOSTLD  scripts/genksyms/genksyms
  CC      scripts/mod/empty.o
  HOSTCC  scripts/mod/mk_elfconfig
  MKELF   scripts/mod/elfconfig.h
  HOSTCC  scripts/mod/file2alias.o
  HOSTCC  scripts/mod/modpost.o
  HOSTCC  scripts/mod/sumversion.o
  HOSTLD  scripts/mod/modpost
  HOSTCC  scripts/kallsyms
  HOSTCC  scripts/conmakehash
  HOSTCC  scripts/bin2c
  CC      init/main.o
  CHK     include/generated/compile.h
  UPD     include/generated/compile.h
  CC      init/version.o
  CC      init/do_mounts.o
  CC      init/do_mounts_rd.o
  CC      init/do_mounts_initrd.o
  LD      init/mounts.o
  CC      init/initramfs.o
  CC      init/calibrate.o
  LD      init/built-in.o
  HOSTCC  usr/gen_init_cpio
  GEN     usr/initramfs_data.cpio
  AS      usr/initramfs_data.o
  LD      usr/built-in.o
  CC      arch/ia64/kernel/acpi.o
  AS      arch/ia64/kernel/entry.o
/arch/ia64/kernel/entry.S: Assembler messages:
/arch/ia64/kernel/entry.S:1811: Error: attempt to move .org backwards
make[2]: *** [arch/ia64/kernel/entry.o] Error 1
make[1]: *** [arch/ia64/kernel] Error 2
make: *** [sub-make] Error 2
  CLEAN   
  CLEAN   init
  CLEAN   usr
  CLEAN   .tmp_versions
  CLEAN   scripts/basic
  CLEAN   scripts/genksyms
  CLEAN   scripts/kconfig
  CLEAN   scripts/mod
  CLEAN   scripts
  CLEAN   include/config include/generated
  CLEAN   .config .version include/linux/version.h

Wed, 13 Dec 2017 10:02:02 -0500, 0.0650s, 598.375kB