Less More Up Down Hide
Linux Kernel Cross Compile Tests

Test Details 2.6.32-rc4-next-20091014/m68knommu/defconfig/compile

id

67974

version

2.6.32-rc4-next-20091014

startdate

2009-10-15 13:55:01.784539-04

enddate

2009-10-15 13:56:51.207584-04

success

f

testtype

compile

project

linux-kernel

owner

xtest@xenon.starfleet

legacyid

state

3

arch

m68knommu

build-disk-space-used

896K

config

defconfig

gcc-version

4.3.1 (GCC)

host-gcc-version

4.1.2 20061115 (prerelease) (Debian 4.1.1-21)

ld-version

2.17.50.0.17.20070615

org-version

2.6.32-rc4-next-20091014

test

compile

total-disk-space-used

423M

log

# /usr/cc217/4.3:/usr/cc217/m68k/bin:/usr/src/xtest/bin:/usr/src/xtest/bin:/bin:/usr/bin:/usr/local/bin
VERSION = 2
PATCHLEVEL = 6
SUBLEVEL = 32
EXTRAVERSION = -rc4
NAME = Man-Eating Seals of Antiquity
## XP /usr/cc217/4.3:/usr/cc217/m68k/bin
## make HOSTCC=gcc-4.1 ARCH=m68knommu CROSS_COMPILE=m68k-linux- CROSS32_COMPILE= O=out/m68knommu defconfig
  HOSTCC  scripts/basic/fixdep
  HOSTCC  scripts/basic/docproc
  HOSTCC  scripts/basic/hash
  GEN     out/m68knommu/Makefile
  HOSTCC  scripts/kconfig/conf.o
  HOSTCC  scripts/kconfig/kxgettext.o
  SHIPPED scripts/kconfig/zconf.tab.c
  SHIPPED scripts/kconfig/lex.zconf.c
  SHIPPED scripts/kconfig/zconf.hash.c
  HOSTCC  scripts/kconfig/zconf.tab.o
  HOSTLD  scripts/kconfig/conf
*** Default configuration is based on 'm5208evb_defconfig'
#
# configuration written to .config
#
## make HOSTCC=gcc-4.1 ARCH=m68knommu CROSS_COMPILE=m68k-linux- CROSS32_COMPILE= O=out/m68knommu 
  GEN     out/m68knommu/Makefile
scripts/kconfig/conf -s arch/m68knommu/Kconfig
  Using  as source for kernel
  GEN     out/m68knommu/Makefile
  CHK     include/linux/version.h
  UPD     include/linux/version.h
  CHK     include/generated/utsrelease.h
  UPD     include/generated/utsrelease.h
  CC      kernel/bounds.s
  GEN     include/generated/bounds.h
  CC      arch/m68knommu/kernel/asm-offsets.s
In file included from /include/linux/kernel.h:15,
                 from /include/linux/sched.h:54,
                 from /arch/m68knommu/kernel/asm-offsets.c:12:
/include/linux/bitops.h:178: error: conflicting types for 'find_next_bit'
/arch/m68k/include/asm/bitops_mm.h:251: error: previous definition of 'find_next_bit' was here
/include/linux/bitops.h:188: error: conflicting types for 'find_next_zero_bit'
/arch/m68k/include/asm/bitops_mm.h:204: error: previous definition of 'find_next_zero_bit' was here
In file included from /arch/m68k/include/asm/thread_info_mm.h:5,
                 from /arch/m68k/include/asm/thread_info.h:4,
                 from /include/linux/thread_info.h:56,
                 from /include/linux/preempt.h:9,
                 from /include/linux/spinlock.h:50,
                 from /include/linux/seqlock.h:29,
                 from /include/linux/time.h:8,
                 from /include/linux/timex.h:56,
                 from /include/linux/sched.h:56,
                 from /arch/m68knommu/kernel/asm-offsets.c:12:
/arch/m68k/include/asm/asm-offsets.h:1:35: error: generated/asm-offsets.h: No such file or directory
In file included from /arch/m68k/include/asm/thread_info_mm.h:7,
                 from /arch/m68k/include/asm/thread_info.h:4,
                 from /include/linux/thread_info.h:56,
                 from /include/linux/preempt.h:9,
                 from /include/linux/spinlock.h:50,
                 from /include/linux/seqlock.h:29,
                 from /include/linux/time.h:8,
                 from /include/linux/timex.h:56,
                 from /include/linux/sched.h:56,
                 from /arch/m68knommu/kernel/asm-offsets.c:12:
/arch/m68k/include/asm/current.h: In function 'get_current':
/arch/m68k/include/asm/current.h:21: error: implicit declaration of function 'current_thread_info'
/arch/m68k/include/asm/current.h:21: error: invalid type argument of '->' (have 'int')
In file included from /arch/m68k/include/asm/page.h:4,
                 from /arch/m68k/include/asm/thread_info_mm.h:9,
                 from /arch/m68k/include/asm/thread_info.h:4,
                 from /include/linux/thread_info.h:56,
                 from /include/linux/preempt.h:9,
                 from /include/linux/spinlock.h:50,
                 from /include/linux/seqlock.h:29,
                 from /include/linux/time.h:8,
                 from /include/linux/timex.h:56,
                 from /include/linux/sched.h:56,
                 from /arch/m68knommu/kernel/asm-offsets.c:12:
/arch/m68k/include/asm/page_mm.h: In function '___pa':
/arch/m68k/include/asm/page_mm.h:125: error: expected ':' or ')' before 'm68k_fixup'
In file included from /arch/m68k/include/asm/page.h:4,
                 from /arch/m68k/include/asm/thread_info_mm.h:9,
                 from /arch/m68k/include/asm/thread_info.h:4,
                 from /include/linux/thread_info.h:56,
                 from /include/linux/preempt.h:9,
                 from /include/linux/spinlock.h:50,
                 from /include/linux/seqlock.h:29,
                 from /include/linux/time.h:8,
                 from /include/linux/timex.h:56,
                 from /include/linux/sched.h:56,
                 from /arch/m68knommu/kernel/asm-offsets.c:12:
/arch/m68k/include/asm/page_mm.h:125:19: error: invalid suffix "b" on integer constant
/arch/m68k/include/asm/page_mm.h: In function '__va':
/arch/m68k/include/asm/page_mm.h:136: error: expected ':' or ')' before 'm68k_fixup'
/arch/m68k/include/asm/page_mm.h:136:19: error: invalid suffix "b" on integer constant
/arch/m68k/include/asm/page_mm.h: In function '__virt_to_node_shift':
/arch/m68k/include/asm/page_mm.h:189: error: expected ':' or ')' before 'm68k_fixup'
/arch/m68k/include/asm/page_mm.h:189:19: error: invalid suffix "b" on integer constant
In file included from /arch/m68knommu/kernel/asm-offsets.c:12:
/include/linux/sched.h: In function 'set_tsk_thread_flag':
/include/linux/sched.h:2296: error: 'TASK_TINFO' undeclared (first use in this function)
/include/linux/sched.h:2296: error: (Each undeclared identifier is reported only once
/include/linux/sched.h:2296: error: for each function it appears in.)
/include/linux/sched.h: In function 'clear_tsk_thread_flag':
/include/linux/sched.h:2301: error: 'TASK_TINFO' undeclared (first use in this function)
/include/linux/sched.h: In function 'test_and_set_tsk_thread_flag':
/include/linux/sched.h:2306: error: 'TASK_TINFO' undeclared (first use in this function)
/include/linux/sched.h: In function 'test_and_clear_tsk_thread_flag':
/include/linux/sched.h:2311: error: 'TASK_TINFO' undeclared (first use in this function)
/include/linux/sched.h: In function 'test_tsk_thread_flag':
/include/linux/sched.h:2316: error: 'TASK_TINFO' undeclared (first use in this function)
/include/linux/sched.h: In function 'need_resched':
/include/linux/sched.h:2367: error: 'TASK_TINFO' undeclared (first use in this function)
make[2]: *** [arch/m68knommu/kernel/asm-offsets.s] Error 1
make[1]: *** [prepare0] Error 2
make: *** [sub-make] Error 2
  CLEAN   
  CLEAN   .tmp_versions
  CLEAN   scripts/basic
  CLEAN   scripts/kconfig
  CLEAN   include/config include/generated
  CLEAN   .config include/linux/version.h

Sun, 25 Jun 2017 06:21:21 -0400, 0.0095s, 650.023kB