Less More Up Down Hide
Linux Kernel Cross Compile Tests

Test Details 2.6.32-rc4-next-20091014/alpha/defconfig/compile

id

67964

version

2.6.32-rc4-next-20091014

startdate

2009-10-15 16:30:20.859994-04

enddate

2009-10-15 16:32:28.438032-04

success

f

testtype

compile

project

linux-kernel

owner

xtest@xenon.starfleet

legacyid

state

3

arch

alpha

build-disk-space-used

5.1M

config

defconfig

gcc-version

4.3.1 (GCC)

host-gcc-version

4.1.2 20061115 (prerelease) (Debian 4.1.1-21)

ld-version

2.18.50.0.8.20080709

org-version

2.6.32-rc4-next-20091014

test

compile

total-disk-space-used

427M

log

# /usr/cc218/4.3:/usr/cc218/alpha/bin:/usr/src/xtest/bin:/usr/src/xtest/bin:/bin:/usr/bin:/usr/local/bin
VERSION = 2
PATCHLEVEL = 6
SUBLEVEL = 32
EXTRAVERSION = -rc4
NAME = Man-Eating Seals of Antiquity
## XP /usr/cc218/4.3:/usr/cc218/alpha/bin
## make HOSTCC=gcc-4.1 ARCH=alpha CROSS_COMPILE=alpha-linux- CROSS32_COMPILE= O=out/alpha defconfig
  HOSTCC  scripts/basic/fixdep
  HOSTCC  scripts/basic/docproc
  HOSTCC  scripts/basic/hash
  GEN     out/alpha/Makefile
  HOSTCC  scripts/kconfig/conf.o
  HOSTCC  scripts/kconfig/kxgettext.o
  SHIPPED scripts/kconfig/zconf.tab.c
  SHIPPED scripts/kconfig/lex.zconf.c
  SHIPPED scripts/kconfig/zconf.hash.c
  HOSTCC  scripts/kconfig/zconf.tab.o
  HOSTLD  scripts/kconfig/conf
scripts/kconfig/conf -d arch/alpha/Kconfig
#
# configuration written to .config
#
## make HOSTCC=gcc-4.1 ARCH=alpha CROSS_COMPILE=alpha-linux- CROSS32_COMPILE= O=out/alpha 
  GEN     out/alpha/Makefile
scripts/kconfig/conf -s arch/alpha/Kconfig
  Using  as source for kernel
  GEN     out/alpha/Makefile
  CHK     include/linux/version.h
  UPD     include/linux/version.h
  CHK     include/generated/utsrelease.h
  UPD     include/generated/utsrelease.h
  CC      kernel/bounds.s
  GEN     include/generated/bounds.h
  CC      arch/alpha/kernel/asm-offsets.s
  GEN     include/generated/asm-offsets.h
  CALL    /scripts/checksyscalls.sh
<stdin>:395:2: warning: #warning syscall umount2 not implemented
<stdin>:1463:2: warning: #warning syscall timerfd_create not implemented
<stdin>:1471:2: warning: #warning syscall fallocate not implemented
<stdin>:1475:2: warning: #warning syscall timerfd_settime not implemented
<stdin>:1479:2: warning: #warning syscall timerfd_gettime not implemented
<stdin>:1483:2: warning: #warning syscall signalfd4 not implemented
<stdin>:1487:2: warning: #warning syscall eventfd2 not implemented
<stdin>:1491:2: warning: #warning syscall epoll_create1 not implemented
<stdin>:1495:2: warning: #warning syscall dup3 not implemented
<stdin>:1499:2: warning: #warning syscall pipe2 not implemented
<stdin>:1503:2: warning: #warning syscall inotify_init1 not implemented
<stdin>:1507:2: warning: #warning syscall preadv not implemented
<stdin>:1511:2: warning: #warning syscall pwritev not implemented
<stdin>:1515:2: warning: #warning syscall rt_tgsigqueueinfo not implemented
<stdin>:1519:2: warning: #warning syscall perf_event_open not implemented
<stdin>:1523:2: warning: #warning syscall recvmmsg not implemented
  CC      scripts/mod/empty.o
  HOSTCC  scripts/mod/mk_elfconfig
  MKELF   scripts/mod/elfconfig.h
  HOSTCC  scripts/mod/file2alias.o
  HOSTCC  scripts/mod/modpost.o
  HOSTCC  scripts/mod/sumversion.o
  HOSTLD  scripts/mod/modpost
  HOSTCC  scripts/kallsyms
  HOSTCC  scripts/conmakehash
  CC      init/main.o
  CHK     include/generated/compile.h
  UPD     include/generated/compile.h
  CC      init/version.o
  CC      init/do_mounts.o
  LD      init/mounts.o
  CC      init/noinitramfs.o
  CC      init/calibrate.o
  LD      init/built-in.o
  LD      usr/built-in.o
  AS      arch/alpha/kernel/entry.o
/arch/alpha/kernel/entry.S: Assembler messages:
/arch/alpha/kernel/entry.S:326: Warning: operand out of range (0x0000000000000406 is not between 0x0000000000000000 and 0x00000000000000ff)
/arch/alpha/kernel/entry.S:388: Warning: operand out of range (0x0000000000000406 is not between 0x0000000000000000 and 0x00000000000000ff)
  CC      arch/alpha/kernel/traps.o
  CC      arch/alpha/kernel/process.o
  CC      arch/alpha/kernel/init_task.o
  CC      arch/alpha/kernel/osf_sys.o
  CC      arch/alpha/kernel/irq.o
  CC      arch/alpha/kernel/irq_alpha.o
  CC      arch/alpha/kernel/signal.o
  CC      arch/alpha/kernel/setup.o
  CC      arch/alpha/kernel/ptrace.o
  CC      arch/alpha/kernel/time.o
  CC      arch/alpha/kernel/alpha_ksyms.o
  AS      arch/alpha/kernel/systbls.o
/arch/alpha/kernel/systbls.S: Assembler messages:
/arch/alpha/kernel/systbls.S:507: Error: .err encountered
make[2]: *** [arch/alpha/kernel/systbls.o] Error 1
make[1]: *** [arch/alpha/kernel] Error 2
make: *** [sub-make] Error 2
  CLEAN   
  CLEAN   init
  CLEAN   .tmp_versions
  CLEAN   scripts/basic
  CLEAN   scripts/kconfig
  CLEAN   scripts/mod
  CLEAN   scripts
  CLEAN   include/config include/generated
  CLEAN   .config .version include/linux/version.h

Mon, 25 Sep 2017 02:16:34 -0400, 0.0101s, 601.562kB