Less More Up Down Hide
Linux Kernel Cross Compile Tests

Test Details 2.6.32-rc4-next-20091013/h8300/defconfig/compile

id

67906

version

2.6.32-rc4-next-20091013

startdate

2009-10-17 04:10:03.610811-04

enddate

2009-10-17 04:12:05.473171-04

success

f

testtype

compile

project

linux-kernel

owner

xtest@defiant.starfleet

legacyid

state

3

arch

h8300

build-disk-space-used

2.6M

config

defconfig

gcc-version

4.0.4

host-gcc-version

4.1.2 20061115 (prerelease) (Debian 4.1.1-21)

ld-version

2.15.94.0.2.2 20041220

org-version

2.6.32-rc4-next-20091013

test

compile

total-disk-space-used

424M

log

# /usr/cc215/4.0:/usr/cc215/h8300/bin:/usr/src/xtest/bin:/usr/src/xtest/bin:/bin:/usr/bin:/usr/local/bin
VERSION = 2
PATCHLEVEL = 6
SUBLEVEL = 32
EXTRAVERSION = -rc4
NAME = Man-Eating Seals of Antiquity
## XP /usr/cc215/4.0:/usr/cc215/h8300/bin
## make HOSTCC=gcc-4.1 ARCH=h8300 CROSS_COMPILE=h8300-linux- CROSS32_COMPILE= O=out/h8300 defconfig
  HOSTCC  scripts/basic/fixdep
  HOSTCC  scripts/basic/docproc
  HOSTCC  scripts/basic/hash
  GEN     out/h8300/Makefile
  HOSTCC  scripts/kconfig/conf.o
  HOSTCC  scripts/kconfig/kxgettext.o
  SHIPPED scripts/kconfig/zconf.tab.c
  SHIPPED scripts/kconfig/lex.zconf.c
  SHIPPED scripts/kconfig/zconf.hash.c
  HOSTCC  scripts/kconfig/zconf.tab.o
  HOSTLD  scripts/kconfig/conf
scripts/kconfig/conf -d arch/h8300/Kconfig
#
# configuration written to .config
#
## make HOSTCC=gcc-4.1 ARCH=h8300 CROSS_COMPILE=h8300-linux- CROSS32_COMPILE= O=out/h8300 
  GEN     out/h8300/Makefile
scripts/kconfig/conf -s arch/h8300/Kconfig
  Using  as source for kernel
  GEN     out/h8300/Makefile
  CHK     include/linux/version.h
  UPD     include/linux/version.h
  CHK     include/generated/utsrelease.h
  UPD     include/generated/utsrelease.h
  CC      kernel/bounds.s
  GEN     include/generated/bounds.h
  CC      arch/h8300/kernel/asm-offsets.s
In file included from /arch/h8300/include/asm/bitops.h:10,
                 from /include/linux/bitops.h:17,
                 from /include/linux/kernel.h:15,
                 from /include/linux/sched.h:54,
                 from /arch/h8300/kernel/asm-offsets.c:12:
/arch/h8300/include/asm/system.h:158: warning: 'struct pt_regs' declared inside parameter list
/arch/h8300/include/asm/system.h:158: warning: its scope is only this definition or declaration, which is probably not what you want
  GEN     include/generated/asm-offsets.h
  CALL    /scripts/checksyscalls.sh
<stdin>:1455:2: warning: #warning syscall utimensat not implemented
<stdin>:1463:2: warning: #warning syscall timerfd_create not implemented
<stdin>:1471:2: warning: #warning syscall fallocate not implemented
<stdin>:1475:2: warning: #warning syscall timerfd_settime not implemented
<stdin>:1479:2: warning: #warning syscall timerfd_gettime not implemented
<stdin>:1483:2: warning: #warning syscall signalfd4 not implemented
<stdin>:1487:2: warning: #warning syscall eventfd2 not implemented
<stdin>:1491:2: warning: #warning syscall epoll_create1 not implemented
<stdin>:1495:2: warning: #warning syscall dup3 not implemented
<stdin>:1499:2: warning: #warning syscall pipe2 not implemented
<stdin>:1503:2: warning: #warning syscall inotify_init1 not implemented
<stdin>:1507:2: warning: #warning syscall preadv not implemented
<stdin>:1511:2: warning: #warning syscall pwritev not implemented
<stdin>:1515:2: warning: #warning syscall rt_tgsigqueueinfo not implemented
<stdin>:1519:2: warning: #warning syscall perf_event_open not implemented
  CC      scripts/mod/empty.o
  HOSTCC  scripts/mod/mk_elfconfig
  MKELF   scripts/mod/elfconfig.h
  HOSTCC  scripts/mod/file2alias.o
  HOSTCC  scripts/mod/modpost.o
  HOSTCC  scripts/mod/sumversion.o
  HOSTLD  scripts/mod/modpost
  CC      init/main.o
  CHK     include/generated/compile.h
  UPD     include/generated/compile.h
  CC      init/version.o
  CC      init/do_mounts.o
  LD      init/mounts.o
  CC      init/noinitramfs.o
In file included from /arch/h8300/include/asm/bitops.h:10,
                 from /include/linux/bitops.h:17,
                 from /include/linux/kernel.h:15,
                 from /include/linux/cache.h:4,
                 from /include/linux/time.h:7,
                 from /include/linux/stat.h:60,
                 from /init/noinitramfs.c:21:
/arch/h8300/include/asm/system.h:158: warning: 'struct pt_regs' declared inside parameter list
/arch/h8300/include/asm/system.h:158: warning: its scope is only this definition or declaration, which is probably not what you want
  CC      init/calibrate.o
In file included from /arch/h8300/include/asm/bitops.h:10,
                 from /include/linux/bitops.h:17,
                 from /include/linux/kernel.h:15,
                 from /include/linux/jiffies.h:5,
                 from /init/calibrate.c:7:
/arch/h8300/include/asm/system.h:158: warning: 'struct pt_regs' declared inside parameter list
/arch/h8300/include/asm/system.h:158: warning: its scope is only this definition or declaration, which is probably not what you want
  LD      init/built-in.o
  LD      usr/built-in.o
  CC      arch/h8300/kernel/process.o
  CC      arch/h8300/kernel/traps.o
In file included from /arch/h8300/include/asm/bitops.h:10,
                 from /include/linux/bitops.h:17,
                 from /include/linux/kernel.h:15,
                 from /include/linux/sched.h:54,
                 from /arch/h8300/kernel/traps.c:18:
/arch/h8300/include/asm/system.h:158: warning: 'struct pt_regs' declared inside parameter list
/arch/h8300/include/asm/system.h:158: warning: its scope is only this definition or declaration, which is probably not what you want
/arch/h8300/kernel/traps.c:100: error: conflicting types for 'die'
/arch/h8300/include/asm/system.h:158: error: previous declaration of 'die' was here
make[2]: *** [arch/h8300/kernel/traps.o] Error 1
make[1]: *** [arch/h8300/kernel] Error 2
make: *** [sub-make] Error 2
  CLEAN   
  CLEAN   init
  CLEAN   .tmp_versions
  CLEAN   scripts/basic
  CLEAN   scripts/kconfig
  CLEAN   scripts/mod
  CLEAN   include/config include/generated
  CLEAN   .config .version include/linux/version.h

Wed, 26 Apr 2017 21:27:10 -0400, 0.0104s, 604.664kB