Less More Up Down Hide
Linux Kernel Cross Compile Tests

Test Details 2.6.32-rc4-git1/xtensa/defconfig/compile

id

67826

version

2.6.32-rc4-git1

startdate

2009-10-12 14:34:10.582189-04

enddate

2009-10-12 14:36:04.829688-04

success

f

testtype

compile

project

linux-kernel

owner

xtest@xenon.starfleet

legacyid

state

3

arch

xtensa

build-disk-space-used

2.0M

config

defconfig

gcc-version

4.3.1 (GCC)

host-gcc-version

4.1.2 20061115 (prerelease) (Debian 4.1.1-21)

ld-version

2.18.50.0.7.20080502

org-version

2.6.32-rc4-git1

test

compile

total-disk-space-used

424M

log

# /usr/cc218/4.3:/usr/cc218/xtensa/bin:/usr/src/xtest/bin:/usr/src/xtest/bin:/bin:/usr/bin:/usr/local/bin
VERSION = 2
PATCHLEVEL = 6
SUBLEVEL = 32
EXTRAVERSION = -rc4-git1
NAME = Man-Eating Seals of Antiquity
## XP /usr/cc218/4.3:/usr/cc218/xtensa/bin
## make HOSTCC=gcc-4.1 ARCH=xtensa CROSS_COMPILE=xtensa-linux- CROSS32_COMPILE= O=out/xtensa defconfig
  HOSTCC  scripts/basic/fixdep
  HOSTCC  scripts/basic/docproc
  HOSTCC  scripts/basic/hash
  GEN     out/xtensa/Makefile
  HOSTCC  scripts/kconfig/conf.o
  HOSTCC  scripts/kconfig/kxgettext.o
  SHIPPED scripts/kconfig/zconf.tab.c
  SHIPPED scripts/kconfig/lex.zconf.c
  SHIPPED scripts/kconfig/zconf.hash.c
  HOSTCC  scripts/kconfig/zconf.tab.o
  HOSTLD  scripts/kconfig/conf
*** Default configuration is based on 'iss_defconfig'
#
# configuration written to .config
#
## make HOSTCC=gcc-4.1 ARCH=xtensa CROSS_COMPILE=xtensa-linux- CROSS32_COMPILE= O=out/xtensa 
  GEN     out/xtensa/Makefile
scripts/kconfig/conf -s arch/xtensa/Kconfig
  Using  as source for kernel
  GEN     out/xtensa/Makefile
  CHK     include/linux/version.h
  UPD     include/linux/version.h
  CHK     include/linux/utsrelease.h
  UPD     include/linux/utsrelease.h
  SYMLINK include/asm -> include/asm-xtensa
  CC      kernel/bounds.s
  GEN     include/linux/bounds.h
  CC      arch/xtensa/kernel/asm-offsets.s
  GEN     include/asm/asm-offsets.h
  CALL    /scripts/checksyscalls.sh
<stdin>:395:2: warning: #warning syscall umount2 not implemented
<stdin>:1431:2: warning: #warning syscall sync_file_range not implemented
<stdin>:1463:2: warning: #warning syscall timerfd_create not implemented
<stdin>:1471:2: warning: #warning syscall fallocate not implemented
<stdin>:1475:2: warning: #warning syscall timerfd_settime not implemented
<stdin>:1479:2: warning: #warning syscall timerfd_gettime not implemented
<stdin>:1483:2: warning: #warning syscall signalfd4 not implemented
<stdin>:1487:2: warning: #warning syscall eventfd2 not implemented
<stdin>:1491:2: warning: #warning syscall epoll_create1 not implemented
<stdin>:1495:2: warning: #warning syscall dup3 not implemented
<stdin>:1499:2: warning: #warning syscall pipe2 not implemented
<stdin>:1503:2: warning: #warning syscall inotify_init1 not implemented
<stdin>:1507:2: warning: #warning syscall preadv not implemented
<stdin>:1511:2: warning: #warning syscall pwritev not implemented
<stdin>:1515:2: warning: #warning syscall rt_tgsigqueueinfo not implemented
<stdin>:1519:2: warning: #warning syscall perf_event_open not implemented
  CC      scripts/mod/empty.o
  HOSTCC  scripts/mod/mk_elfconfig
  MKELF   scripts/mod/elfconfig.h
  HOSTCC  scripts/mod/file2alias.o
  HOSTCC  scripts/mod/modpost.o
  HOSTCC  scripts/mod/sumversion.o
  HOSTLD  scripts/mod/modpost
  HOSTCC  scripts/kallsyms
  HOSTCC  scripts/conmakehash
  CC      init/main.o
  CHK     include/linux/compile.h
  UPD     include/linux/compile.h
  CC      init/version.o
  CC      init/do_mounts.o
  LD      init/mounts.o
  CC      init/noinitramfs.o
  LD      init/built-in.o
  LD      usr/built-in.o
  AS      arch/xtensa/kernel/align.o
  AS      arch/xtensa/kernel/entry.o
  CC      arch/xtensa/kernel/irq.o
  AS      arch/xtensa/kernel/coprocessor.o
  CC      arch/xtensa/kernel/process.o
/arch/xtensa/kernel/process.c: In function 'copy_thread':
/arch/xtensa/kernel/process.c:180: warning: unused variable 'ti'
  CC      arch/xtensa/kernel/ptrace.o
  CC      arch/xtensa/kernel/setup.o
  CC      arch/xtensa/kernel/signal.o
  CC      arch/xtensa/kernel/syscall.o
  CC      arch/xtensa/kernel/time.o
/arch/xtensa/kernel/time.c:42: warning: initialization from incompatible pointer type
  CC      arch/xtensa/kernel/traps.o
  AS      arch/xtensa/kernel/vectors.o
  CC      arch/xtensa/kernel/platform.o
  CC      arch/xtensa/kernel/pci-dma.o
  CC      arch/xtensa/kernel/init_task.o
  CC      arch/xtensa/kernel/io.o
  CC      arch/xtensa/kernel/pci.o
/arch/xtensa/kernel/pci.c: In function 'pcibios_align_resource':
/arch/xtensa/kernel/pci.c:84: warning: format '%ld' expects type 'long int', but argument 4 has type 'resource_size_t'
/arch/xtensa/kernel/pci.c: In function '__pci_mmap_set_pgprot':
/arch/xtensa/kernel/pci.c:362: error: '_PAGE_NO_CACHE' undeclared (first use in this function)
/arch/xtensa/kernel/pci.c:362: error: (Each undeclared identifier is reported only once
/arch/xtensa/kernel/pci.c:362: error: for each function it appears in.)
make[2]: *** [arch/xtensa/kernel/pci.o] Error 1
make[1]: *** [arch/xtensa/kernel] Error 2
make: *** [sub-make] Error 2
  CLEAN   
  CLEAN   init
  CLEAN   .tmp_versions
  CLEAN   scripts/basic
  CLEAN   scripts/kconfig
  CLEAN   scripts/mod
  CLEAN   scripts
  CLEAN   include/config include2 include/generated
  CLEAN   .config include/asm .version include/linux/autoconf.h include/linux/version.h include/linux/utsrelease.h include/linux/bounds.h include/asm/asm-offsets.h include/asm-xtensa/asm-offsets.h

Sat, 25 Mar 2017 07:32:54 -0400, 0.0088s, 602.922kB