Less More Up Down Hide
Linux Kernel Cross Compile Tests

Test Details 2.6.32-rc3-next-20091007/score/defconfig/compile

id

67588

version

2.6.32-rc3-next-20091007

startdate

2009-10-07 02:40:03.194348-04

enddate

2009-10-07 02:41:45.432723-04

success

f

testtype

compile

project

linux-kernel

owner

xtest@defiant.starfleet

legacyid

state

3

arch

score

build-disk-space-used

1.7M

config

defconfig

gcc-version

4.2.1

host-gcc-version

4.1.2 20061115 (prerelease) (Debian 4.1.1-21)

ld-version

2.19.51.20081224

org-version

2.6.32-rc3-next-20091007

test

compile

total-disk-space-used

426M

log

# /opt/score-linux/bin:/usr/src/xtest/bin:/usr/src/xtest/bin:/bin:/usr/bin:/usr/local/bin
VERSION = 2
PATCHLEVEL = 6
SUBLEVEL = 32
EXTRAVERSION = -rc3
NAME = Man-Eating Seals of Antiquity
## XP /opt/score-linux/bin
## make HOSTCC=gcc-4.1 ARCH=score CROSS_COMPILE=score-linux- CROSS32_COMPILE= O=out/score defconfig
  HOSTCC  scripts/basic/fixdep
  HOSTCC  scripts/basic/docproc
  HOSTCC  scripts/basic/hash
  GEN     out/score/Makefile
  HOSTCC  scripts/kconfig/conf.o
  HOSTCC  scripts/kconfig/kxgettext.o
  SHIPPED scripts/kconfig/zconf.tab.c
  SHIPPED scripts/kconfig/lex.zconf.c
  SHIPPED scripts/kconfig/zconf.hash.c
  HOSTCC  scripts/kconfig/zconf.tab.o
  HOSTLD  scripts/kconfig/conf
*** Default configuration is based on 'spct6600_defconfig'
#
# configuration written to .config
#
## make HOSTCC=gcc-4.1 ARCH=score CROSS_COMPILE=score-linux- CROSS32_COMPILE= O=out/score 
  GEN     out/score/Makefile
scripts/kconfig/conf -s arch/score/Kconfig
  Using  as source for kernel
  GEN     out/score/Makefile
  CHK     include/linux/version.h
  UPD     include/linux/version.h
  CHK     include/generated/utsrelease.h
  UPD     include/generated/utsrelease.h
  CC      kernel/bounds.s
  GEN     include/generated/bounds.h
  CC      arch/score/kernel/asm-offsets.s
  GEN     include/generated/asm-offsets.h
  CALL    /scripts/checksyscalls.sh
  CC      scripts/mod/empty.o
  HOSTCC  scripts/mod/mk_elfconfig
  MKELF   scripts/mod/elfconfig.h
  HOSTCC  scripts/mod/file2alias.o
  HOSTCC  scripts/mod/modpost.o
  HOSTCC  scripts/mod/sumversion.o
  HOSTLD  scripts/mod/modpost
  HOSTCC  scripts/conmakehash
  CC      init/main.o
  CHK     include/generated/compile.h
  UPD     include/generated/compile.h
  CC      init/version.o
  CC      init/do_mounts.o
  CC      init/do_mounts_rd.o
  CC      init/do_mounts_initrd.o
  LD      init/mounts.o
  CC      init/initramfs.o
In file included from /include/linux/delay.h:14,
                 from /init/initramfs.c:6:
/arch/score/include/asm/delay.h: In function '__udelay':
/arch/score/include/asm/delay.h:19: error: 'HZ' undeclared (first use in this function)
/arch/score/include/asm/delay.h:19: error: (Each undeclared identifier is reported only once
/arch/score/include/asm/delay.h:19: error: for each function it appears in.)
make[2]: *** [init/initramfs.o] Error 1
make[1]: *** [init] Error 2
make: *** [sub-make] Error 2
  CLEAN   
  CLEAN   init
  CLEAN   .tmp_versions
  CLEAN   scripts/basic
  CLEAN   scripts/kconfig
  CLEAN   scripts/mod
  CLEAN   scripts
  CLEAN   include/config include/generated
  CLEAN   .config .version include/linux/version.h

Sun, 23 Apr 2017 04:06:36 -0400, 0.0101s, 595.984kB