Less More Up Down Hide
Linux Kernel Cross Compile Tests

Test Details 2.6.31-git4/arm/defconfig/compile

id

66144

version

2.6.31-git4

startdate

2009-10-18 21:30:01.781753-04

enddate

2009-10-18 21:31:44.333138-04

success

f

testtype

compile

project

linux-kernel

owner

xtest@xenon.starfleet

legacyid

state

3

arch

arm

build-disk-space-used

4.7M

config

defconfig

gcc-version

4.3.1 (GCC)

host-gcc-version

4.1.2 20061115 (prerelease) (Debian 4.1.1-21)

ld-version

2.18.50.0.7.20080502

org-version

2.6.31-git4

test

compile

total-disk-space-used

414M

log

# /usr/cc218/4.3:/usr/cc218/arm/bin:/usr/src/xtest/bin:/usr/src/xtest/bin:/bin:/usr/bin:/usr/local/bin
VERSION = 2
PATCHLEVEL = 6
SUBLEVEL = 31
EXTRAVERSION = -git4
NAME = Man-Eating Seals of Antiquity
## XP /usr/cc218/4.3:/usr/cc218/arm/bin
## make HOSTCC=gcc-4.1 ARCH=arm CROSS_COMPILE=arm-linux- CROSS32_COMPILE= O=out/arm defconfig
  HOSTCC  scripts/basic/fixdep
  HOSTCC  scripts/basic/docproc
  HOSTCC  scripts/basic/hash
  GEN     out/arm/Makefile
  HOSTCC  scripts/kconfig/conf.o
  HOSTCC  scripts/kconfig/kxgettext.o
  SHIPPED scripts/kconfig/zconf.tab.c
  SHIPPED scripts/kconfig/lex.zconf.c
  SHIPPED scripts/kconfig/zconf.hash.c
  HOSTCC  scripts/kconfig/zconf.tab.o
  HOSTLD  scripts/kconfig/conf
*** Default configuration is based on 'versatile_defconfig'
#
# configuration written to .config
#
## make HOSTCC=gcc-4.1 ARCH=arm CROSS_COMPILE=arm-linux- CROSS32_COMPILE= O=out/arm 
  GEN     out/arm/Makefile
scripts/kconfig/conf -s arch/arm/Kconfig
  CHK     include/linux/version.h
  UPD     include/linux/version.h
  Generating include/asm-arm/mach-types.h
  Using  as source for kernel
  GEN     out/arm/Makefile
  CHK     include/linux/utsrelease.h
  UPD     include/linux/utsrelease.h
  SYMLINK include/asm -> include/asm-arm
  CC      kernel/bounds.s
  GEN     include/linux/bounds.h
  CC      arch/arm/kernel/asm-offsets.s
  GEN     include/asm/asm-offsets.h
  CALL    /scripts/checksyscalls.sh
<stdin>:1351:2: warning: #warning syscall migrate_pages not implemented
  CC      scripts/mod/empty.o
  HOSTCC  scripts/mod/mk_elfconfig
  MKELF   scripts/mod/elfconfig.h
  HOSTCC  scripts/mod/file2alias.o
  HOSTCC  scripts/mod/modpost.o
  HOSTCC  scripts/mod/sumversion.o
  HOSTLD  scripts/mod/modpost
  HOSTCC  scripts/kallsyms
  HOSTCC  scripts/conmakehash
  CC      init/main.o
  CHK     include/linux/compile.h
  UPD     include/linux/compile.h
  CC      init/version.o
  CC      init/do_mounts.o
  CC      init/do_mounts_rd.o
  CC      init/do_mounts_initrd.o
  LD      init/mounts.o
  CC      init/initramfs.o
  CC      init/calibrate.o
  LD      init/built-in.o
  HOSTCC  usr/gen_init_cpio
  GEN     usr/initramfs_data.cpio
  AS      usr/initramfs_data.o
  LD      usr/built-in.o
  CC      arch/arm/kernel/compat.o
  CC      arch/arm/kernel/elf.o
  AS      arch/arm/kernel/entry-armv.o
  AS      arch/arm/kernel/entry-common.o
  CC      arch/arm/kernel/irq.o
  CC      arch/arm/kernel/process.o
  CC      arch/arm/kernel/ptrace.o
  CC      arch/arm/kernel/return_address.o
  CC      arch/arm/kernel/setup.o
  CC      arch/arm/kernel/signal.o
  CC      arch/arm/kernel/sys_arm.o
  CC      arch/arm/kernel/stacktrace.o
  CC      arch/arm/kernel/time.o
  CC      arch/arm/kernel/traps.o
  CC      arch/arm/kernel/armksyms.o
  CC      arch/arm/kernel/module.o
  CC      arch/arm/kernel/io.o
  AS      arch/arm/kernel/debug.o
  LD      arch/arm/kernel/built-in.o
  AS      arch/arm/kernel/head.o
  CC      arch/arm/kernel/init_task.o
  LDS     arch/arm/kernel/vmlinux.lds
  CC      arch/arm/mm/dma-mapping.o
  CC      arch/arm/mm/extable.o
  CC      arch/arm/mm/fault.o
  CC      arch/arm/mm/init.o
  CC      arch/arm/mm/iomap.o
  CC      arch/arm/mm/fault-armv.o
  CC      arch/arm/mm/flush.o
  CC      arch/arm/mm/ioremap.o
  CC      arch/arm/mm/mmap.o
  CC      arch/arm/mm/pgd.o
  CC      arch/arm/mm/mmu.o
/arch/arm/mm/mmu.c: In function 'sanity_check_meminfo':
/arch/arm/mm/mmu.c:690: warning: unused variable 'highmem'
  CC      arch/arm/mm/proc-syms.o
  CC      arch/arm/mm/alignment.o
  AS      arch/arm/mm/abort-ev5tj.o
  CC      arch/arm/mm/copypage-v4wb.o
  AS      arch/arm/mm/tlb-v4wbi.o
  AS      arch/arm/mm/proc-arm926.o
  LD      arch/arm/mm/built-in.o
  CC      arch/arm/common/vic.o
In file included from /arch/arm/common/vic.c:25:
/include/linux/amba/bus.h:16: error: field 'dev' has incomplete type
/include/linux/amba/bus.h:17: error: field 'res' has incomplete type
/include/linux/amba/bus.h:30: error: field 'drv' has incomplete type
make[2]: *** [arch/arm/common/vic.o] Error 1
make[1]: *** [arch/arm/common] Error 2
make: *** [sub-make] Error 2
  CLEAN   
  CLEAN   arch/arm/kernel
  CLEAN   init
  CLEAN   usr
  CLEAN   .tmp_versions
  CLEAN   include/asm-arm/mach-types.h
  CLEAN   scripts/basic
  CLEAN   scripts/kconfig
  CLEAN   scripts/mod
  CLEAN   scripts
  CLEAN   include/config include2
  CLEAN   .config include/asm .version include/linux/autoconf.h include/linux/version.h include/linux/utsrelease.h include/linux/bounds.h include/asm-arm/asm-offsets.h include/asm/asm-offsets.h

Wed, 23 May 2018 00:58:50 -0400, 0.0087s, 601.617kB